Skip to content

Dependency Updater #1831

Dependency Updater

Dependency Updater #1831

Manually triggered February 6, 2025 00:23
Status Failure
Total duration 1h 39m 15s
Artifacts 2

dependency-updater.yml

on: workflow_dispatch
Fit to window
Zoom out
Zoom in

Annotations

2 errors and 1 warning
build
PR BUILD not successfull. Check artifacts for logs.
build
Process completed with exit code 1.
build
=========================================================== product-is BUILD FAILURE ========================================================== [INFO] Results: [INFO] [ERROR] Failures: [ERROR] org.wso2.identity.integration.test.scim2.SCIM2PaginationTestCase.testUserListingPagination(org.wso2.identity.integration.test.scim2.SCIM2PaginationTestCase) [ERROR] Run 1: SCIM2PaginationTestCase.testUserListingPagination:125->getCurrentUsersCount:282 » AxisFault [ERROR] Run 2: SCIM2PaginationTestCase.testUserListingPagination:125->getCurrentUsersCount:282 » AxisFault [INFO] [ERROR] org.wso2.identity.integration.test.scim2.SCIM2PaginationTestCase.testUserListingPaginationWithoutParams(org.wso2.identity.integration.test.scim2.SCIM2PaginationTestCase) [ERROR] Run 1: SCIM2PaginationTestCase.testUserListingPaginationWithoutParams:157->getCurrentUsersCount:282 » AxisFault [ERROR] Run 2: SCIM2PaginationTestCase.testUserListingPaginationWithoutParams:157->getCurrentUsersCount:282 » AxisFault [INFO] [ERROR] JDBCBasedUserMgtTestCase.testInit:39 » UserAdminUserAdmin UserAdminUserAdminEx... [INFO] [ERROR] Tests run: 3237, Failures: 3, Errors: 0, Skipped: 18 [INFO] [INFO] ------------------------------------------------------------------------ [INFO] Reactor Summary for WSO2 Identity Server 7.1.0-alpha2-SNAPSHOT: [INFO] [INFO] WSO2 Identity Server ............................... SUCCESS [ 0.420 s] [INFO] WSO2 Identity Server Styles Parent ................. SUCCESS [ 0.048 s] [INFO] Identity Server: UI styles ......................... SUCCESS [ 2.395 s] [INFO] WSO2 IS - Features Aggregator Module ............... SUCCESS [ 0.017 s] [INFO] WSO2 IS - Style Features ........................... SUCCESS [ 0.773 s] [INFO] WSO2 IS - Utils Features ........................... SUCCESS [ 0.164 s] [INFO] WSO2 Carbon - Identity UI Feature .................. SUCCESS [ 0.902 s] [INFO] WSO2 IS - IS Profile Generation .................... SUCCESS [ 38.548 s] [INFO] Identity Server : Connector ........................ SUCCESS [ 0.309 s] [INFO] WSO2 Identity Server - Rest API .................... SUCCESS [ 0.011 s] [INFO] WSO2 Identity Server - All Rest API ................ SUCCESS [ 16.674 s] [INFO] Identity Server : identity-authenticators .......... SUCCESS [ 0.020 s] [INFO] Identity Server : Social-authenticators ............ SUCCESS [ 0.028 s] [INFO] Identity Server : Provisioning Connectors .......... SUCCESS [ 0.023 s] [INFO] Identity Server : identity-local-authenticators .... SUCCESS [ 0.027 s] [INFO] Identity Server : oauth2-grant-types ............... SUCCESS [ 0.015 s] [INFO] Identity Server : identity-integration-ui-templates SUCCESS [ 0.147 s] [INFO] Identity Server .................................... SUCCESS [ 24.287 s] [INFO] WSO2 Identity Integration Test Utils ............... SUCCESS [ 0.014 s] [INFO] org.wso2.carbon.identity.test.integration.service .. SUCCESS [ 2.485 s] [INFO] org.wso2.carbon.identity.test.integration.service.stubs SUCCESS [ 5.998 s] [INFO] Identity Server Integration Tests .................. SUCCESS [ 2.261 s] [INFO] WSO2 IS - Integration Test Admin Clients Module .... SUCCESS [ 4.936 s] [INFO] WSO2 IS - Integration UI Pages Module .............. SUCCESS [ 1.988 s] [INFO] WSO2 IS - Integration Test Utils Module ............ SUCCESS [ 2.354 s] [INFO] jacoco-report-generator ............................ SUCCESS [ 1.875 s] [INFO] WSO2 Identity Integration Test Common .............. SUCCESS [ 1.290 s] [INFO] Identity Test Back-end Module ...................... FAILURE [ 01:34 h] [INFO] org.wso2.identity.integration.test ................. SKIPPED [INFO] ------------------------------------------------------------------------ [INFO] BUILD FAILURE [INFO] ------------------------------------------------------------------------ [INFO] Total time: 01:35 h [INFO] Finished at: 2025-02-06T02:02:45Z [INFO] ------------------------------------------------------------------------ [ERROR] Failed to execute goal org.apache.maven.plugins:maven-surefire-plugin:2.22.1:test (default

Artifacts

Produced during runtime
Name Size Digest
dependency-updates-diff
1018 Bytes
sha256:ea0e256427c0c843bcb7827b2f1265a7f1e446b854962d226e76fd334e23c49d
mvn-build.log
837 KB
sha256:2b5c132c0ca2e7759ccc88d2615621bf8324bf33101faa0b7706a6947152d984