Integration Test Runner For PRs #709
integration-test-runner-JDK11.yml
on: workflow_dispatch
build
1h 49m
Annotations
2 errors and 3 warnings
build
PR BUILD not successfull. Check artifacts for logs.
|
build
Process completed with exit code 1.
|
|
build
===========================================================
identity-inbound-auth-oauth BUILD SUCCESS
==========================================================
Built version: 7.0.230-SNAPSHOT
[INFO] Results:
[INFO]
[INFO] Tests run: 8, Failures: 0, Errors: 0, Skipped: 0
[INFO] Results:
[INFO]
[INFO] Tests run: 70, Failures: 0, Errors: 0, Skipped: 0
[INFO] Results:
[INFO]
[INFO] Tests run: 38, Failures: 0, Errors: 0, Skipped: 0
[INFO] Results:
[INFO]
[INFO] Tests run: 2227, Failures: 0, Errors: 0, Skipped: 0
[INFO] Results:
[INFO]
[INFO] Tests run: 19, Failures: 0, Errors: 0, Skipped: 0
[INFO] Results:
[INFO]
[INFO] Tests run: 25, Failures: 0, Errors: 0, Skipped: 0
[INFO] Results:
[INFO]
[INFO] Tests run: 76, Failures: 0, Errors: 0, Skipped: 0
[INFO] Results:
[INFO]
[INFO] Tests run: 32, Failures: 0, Errors: 0, Skipped: 0
[INFO] Results:
[INFO]
[INFO] Tests run: 208, Failures: 0, Errors: 0, Skipped: 0
[INFO] Results:
[INFO]
[INFO] Tests run: 852, Failures: 0, Errors: 0, Skipped: 0
[INFO] Results:
[INFO]
[INFO] Tests run: 319, Failures: 0, Errors: 0, Skipped: 0
[INFO] Results:
[INFO]
[INFO] Tests run: 36, Failures: 0, Errors: 0, Skipped: 0
[INFO] Results:
[INFO]
[INFO] Tests run: 31, Failures: 0, Errors: 0, Skipped: 0
[INFO] Results:
[INFO]
[INFO] Tests run: 28, Failures: 0, Errors: 0, Skipped: 0
|
build
===========================================================
product-is BUILD FAILURE
==========================================================
[INFO] Results:
[INFO]
[ERROR] Failures:
[ERROR] org.wso2.identity.integration.test.EmailOTPTestCase.testEmailOTPAuthentication(org.wso2.identity.integration.test.EmailOTPTestCase)
[INFO] Run 1: PASS
[ERROR] Run 2: EmailOTPTestCase.testEmailOTPAuthentication:196 Error in redirection to email OTP authentication page for user: testuser1 expected:<true> but was:<false>
[INFO]
[ERROR] org.wso2.identity.integration.test.recovery.UsernameRecoveryTestCase.testUsernameRecoveryWithBothChannels(org.wso2.identity.integration.test.recovery.UsernameRecoveryTestCase)
[ERROR] Run 1: UsernameRecoveryTestCase.testUsernameRecoveryWithBothChannels:244 Received username does not match. expected:<PRIMARY/user1> but was:<PRIMARY/testUser1>
[ERROR] Run 2: UsernameRecoveryTestCase.testUsernameRecoveryWithBothChannels:229->OIDCAbstractIntegrationTest.createUser:95 User creation failed expected:<201> but was:<409>
[ERROR] Run 3: UsernameRecoveryTestCase.testUsernameRecoveryWithBothChannels:244 Received username does not match. expected:<PRIMARY/user1> but was:<WSO2TEST.COM/testUser1>
[ERROR] Run 4: UsernameRecoveryTestCase.testUsernameRecoveryWithBothChannels:229->OIDCAbstractIntegrationTest.createUser:95 User creation failed expected:<201> but was:<409>
[INFO]
[ERROR] org.wso2.identity.integration.test.scim2.SCIM2PaginationTestCase.testUserListingPagination(org.wso2.identity.integration.test.scim2.SCIM2PaginationTestCase)
[ERROR] Run 1: SCIM2PaginationTestCase.testUserListingPagination:125->getCurrentUsersCount:282 » AxisFault
[ERROR] Run 2: SCIM2PaginationTestCase.testUserListingPagination:125->getCurrentUsersCount:282 » AxisFault
[INFO]
[ERROR] org.wso2.identity.integration.test.scim2.SCIM2PaginationTestCase.testUserListingPaginationWithoutParams(org.wso2.identity.integration.test.scim2.SCIM2PaginationTestCase)
[ERROR] Run 1: SCIM2PaginationTestCase.testUserListingPaginationWithoutParams:157->getCurrentUsersCount:282 » AxisFault
[ERROR] Run 2: SCIM2PaginationTestCase.testUserListingPaginationWithoutParams:157->getCurrentUsersCount:282 » AxisFault
[INFO]
[ERROR] JDBCBasedUserMgtTestCase.testInit:39 » UserAdminUserAdmin UserAdminUserAdminEx...
[INFO]
[ERROR] Tests run: 3233, Failures: 5, Errors: 0, Skipped: 18
[INFO]
[INFO] ------------------------------------------------------------------------
[INFO] Reactor Summary for WSO2 Identity Server 7.1.0-alpha2-SNAPSHOT:
[INFO]
[INFO] WSO2 Identity Server ............................... SUCCESS [ 0.455 s]
[INFO] WSO2 Identity Server Styles Parent ................. SUCCESS [ 0.048 s]
[INFO] Identity Server: UI styles ......................... SUCCESS [ 2.516 s]
[INFO] WSO2 IS - Features Aggregator Module ............... SUCCESS [ 0.017 s]
[INFO] WSO2 IS - Style Features ........................... SUCCESS [ 0.988 s]
[INFO] WSO2 IS - Utils Features ........................... SUCCESS [ 0.194 s]
[INFO] WSO2 Carbon - Identity UI Feature .................. SUCCESS [ 1.269 s]
[INFO] WSO2 IS - IS Profile Generation .................... SUCCESS [01:28 min]
[INFO] Identity Server : Connector ........................ SUCCESS [ 7.817 s]
[INFO] WSO2 Identity Server - Rest API .................... SUCCESS [ 0.011 s]
[INFO] WSO2 Identity Server - All Rest API ................ SUCCESS [ 49.366 s]
[INFO] Identity Server : identity-authenticators .......... SUCCESS [ 0.027 s]
[INFO] Identity Server : Social-authenticators ............ SUCCESS [ 0.033 s]
[INFO] Identity Server : Provisioning Connectors .......... SUCCESS [ 0.025 s]
[INFO] Identity Server : identity-local-authenticators .... SUCCESS [ 0.031 s]
[INFO] Identity Server : oauth2-grant-types ............... SUCCESS [ 0.017 s]
[INFO] Identity Server : identity-integration-ui-templates SUCCESS [ 0.159 s]
[INFO] Identity Server .................................... SUCCESS [ 25.506 s]
[INFO] WSO2 Identity Integration Test Utils ............... SUCCESS [ 0.010 s]
|
Artifacts
Produced during runtime
Name | Size | Digest | |
---|---|---|---|
product-is-mvn-build-log
|
827 KB |
sha256:6653ab150a6a21b530a5369f3a83be2b01558e612a50de451122dacd4dda61da
|
|
product-is-surefire-report
|
968 KB |
sha256:dca33eaf4166432be2852d0a7fa60b26e846dd8545279bd84bd8471f88b127b0
|
|
repo-mvn-build-log
|
77.6 KB |
sha256:c5eff33ca36ecf85a5584609d6751fec194bd7a1dd959570d171f06abfe188fb
|
|
repo-pr-diff
|
1011 Bytes |
sha256:13d183bc4f5141ac95df7b966548a6d5f2470291d9b9f2a96ba3dbdef087ed37
|
|
repo-surefire-report
|
2.04 MB |
sha256:a13a745d9d78f80139e295783a83bf84fab01a3c5f495a113898fa3551e4bc85
|
|