Integration Test Runner For PRs #717
integration-test-runner-JDK11.yml
on: workflow_dispatch
build
1h 44m
Annotations
2 errors and 3 warnings
build
PR BUILD not successfull. Check artifacts for logs.
|
build
Process completed with exit code 1.
|
|
build
===========================================================
identity-inbound-auth-oauth BUILD SUCCESS
==========================================================
Built version: 7.0.230-SNAPSHOT
[INFO] Results:
[INFO]
[INFO] Tests run: 8, Failures: 0, Errors: 0, Skipped: 0
[INFO] Results:
[INFO]
[INFO] Tests run: 70, Failures: 0, Errors: 0, Skipped: 0
[INFO] Results:
[INFO]
[INFO] Tests run: 38, Failures: 0, Errors: 0, Skipped: 0
[INFO] Results:
[INFO]
[INFO] Tests run: 2227, Failures: 0, Errors: 0, Skipped: 0
[INFO] Results:
[INFO]
[INFO] Tests run: 19, Failures: 0, Errors: 0, Skipped: 0
[INFO] Results:
[INFO]
[INFO] Tests run: 25, Failures: 0, Errors: 0, Skipped: 0
[INFO] Results:
[INFO]
[INFO] Tests run: 76, Failures: 0, Errors: 0, Skipped: 0
[INFO] Results:
[INFO]
[INFO] Tests run: 32, Failures: 0, Errors: 0, Skipped: 0
[INFO] Results:
[INFO]
[INFO] Tests run: 208, Failures: 0, Errors: 0, Skipped: 0
[INFO] Results:
[INFO]
[INFO] Tests run: 852, Failures: 0, Errors: 0, Skipped: 0
[INFO] Results:
[INFO]
[INFO] Tests run: 319, Failures: 0, Errors: 0, Skipped: 0
[INFO] Results:
[INFO]
[INFO] Tests run: 36, Failures: 0, Errors: 0, Skipped: 0
[INFO] Results:
[INFO]
[INFO] Tests run: 31, Failures: 0, Errors: 0, Skipped: 0
[INFO] Results:
[INFO]
[INFO] Tests run: 28, Failures: 0, Errors: 0, Skipped: 0
|
build
===========================================================
product-is BUILD FAILURE
==========================================================
[INFO] Results:
[INFO]
[ERROR] Failures:
[ERROR] org.wso2.identity.integration.test.scim2.SCIM2PaginationTestCase.testUserListingPagination(org.wso2.identity.integration.test.scim2.SCIM2PaginationTestCase)
[ERROR] Run 1: SCIM2PaginationTestCase.testUserListingPagination:125->getCurrentUsersCount:282 » AxisFault
[ERROR] Run 2: SCIM2PaginationTestCase.testUserListingPagination:125->getCurrentUsersCount:282 » AxisFault
[INFO]
[ERROR] org.wso2.identity.integration.test.scim2.SCIM2PaginationTestCase.testUserListingPaginationWithoutParams(org.wso2.identity.integration.test.scim2.SCIM2PaginationTestCase)
[ERROR] Run 1: SCIM2PaginationTestCase.testUserListingPaginationWithoutParams:157->getCurrentUsersCount:282 » AxisFault
[ERROR] Run 2: SCIM2PaginationTestCase.testUserListingPaginationWithoutParams:157->getCurrentUsersCount:282 » AxisFault
[INFO]
[ERROR] JDBCBasedUserMgtTestCase.testInit:39 » UserAdminUserAdmin UserAdminUserAdminEx...
[INFO]
[ERROR] Tests run: 3237, Failures: 3, Errors: 0, Skipped: 18
[INFO]
[INFO] ------------------------------------------------------------------------
[INFO] Reactor Summary for WSO2 Identity Server 7.1.0-alpha2-SNAPSHOT:
[INFO]
[INFO] WSO2 Identity Server ............................... SUCCESS [ 0.460 s]
[INFO] WSO2 Identity Server Styles Parent ................. SUCCESS [ 0.046 s]
[INFO] Identity Server: UI styles ......................... SUCCESS [ 2.687 s]
[INFO] WSO2 IS - Features Aggregator Module ............... SUCCESS [ 0.020 s]
[INFO] WSO2 IS - Style Features ........................... SUCCESS [ 0.762 s]
[INFO] WSO2 IS - Utils Features ........................... SUCCESS [ 0.178 s]
[INFO] WSO2 Carbon - Identity UI Feature .................. SUCCESS [ 0.935 s]
[INFO] WSO2 IS - IS Profile Generation .................... SUCCESS [ 39.600 s]
[INFO] Identity Server : Connector ........................ SUCCESS [ 0.534 s]
[INFO] WSO2 Identity Server - Rest API .................... SUCCESS [ 0.013 s]
[INFO] WSO2 Identity Server - All Rest API ................ SUCCESS [ 22.081 s]
[INFO] Identity Server : identity-authenticators .......... SUCCESS [ 0.064 s]
[INFO] Identity Server : Social-authenticators ............ SUCCESS [ 0.030 s]
[INFO] Identity Server : Provisioning Connectors .......... SUCCESS [ 0.025 s]
[INFO] Identity Server : identity-local-authenticators .... SUCCESS [ 0.028 s]
[INFO] Identity Server : oauth2-grant-types ............... SUCCESS [ 0.016 s]
[INFO] Identity Server : identity-integration-ui-templates SUCCESS [ 0.150 s]
[INFO] Identity Server .................................... SUCCESS [ 25.084 s]
[INFO] WSO2 Identity Integration Test Utils ............... SUCCESS [ 0.009 s]
[INFO] org.wso2.carbon.identity.test.integration.service .. SUCCESS [ 2.523 s]
[INFO] org.wso2.carbon.identity.test.integration.service.stubs SUCCESS [ 5.871 s]
[INFO] Identity Server Integration Tests .................. SUCCESS [ 2.680 s]
[INFO] WSO2 IS - Integration Test Admin Clients Module .... SUCCESS [ 5.527 s]
[INFO] WSO2 IS - Integration UI Pages Module .............. SUCCESS [ 2.049 s]
[INFO] WSO2 IS - Integration Test Utils Module ............ SUCCESS [ 2.670 s]
[INFO] jacoco-report-generator ............................ SUCCESS [ 1.815 s]
[INFO] WSO2 Identity Integration Test Common .............. SUCCESS [ 1.126 s]
[INFO] Identity Test Back-end Module ...................... FAILURE [ 01:33 h]
[INFO] org.wso2.identity.integration.test ................. SKIPPED
[INFO] ------------------------------------------------------------------------
[INFO] BUILD FAILURE
[INFO] ------------------------------------------------------------------------
[INFO] Total time: 01:35 h
[INFO] Finished at: 2025-02-06T10:02:28Z
[INFO] ------------------------------------------------------------------------
[ERROR] Failed to execute goal org.apache.maven.plugins:maven-surefire-plugin:2.22.1:test (default
|
Artifacts
Produced during runtime
Name | Size | Digest | |
---|---|---|---|
product-is-mvn-build-log
|
829 KB |
sha256:a98d4bb9263bf6fc77be02ded1427d9a5002b823e01be778177fa27990f669a4
|
|
product-is-surefire-report
|
945 KB |
sha256:40fd243dab87d2f6bc65c91e8fa669308ca57ba16590d3a77589b0a42932350f
|
|
repo-mvn-build-log
|
77.8 KB |
sha256:cc82b4d48c687467b3078c10e685f07437a4595f6c5f61974e22ccdf17ef1a2e
|
|
repo-pr-diff
|
1011 Bytes |
sha256:8d65cd1709f484e8167be909260c74397f1f416e7910efc9c4f584d9022ba4c8
|
|
repo-surefire-report
|
2.04 MB |
sha256:02acbc1b8abeb768df46a96fec4c905325799e06c61717aff7629c7bcaf0363f
|
|