Skip to content

Integration Test Runner For PRs #720

Integration Test Runner For PRs

Integration Test Runner For PRs #720

Manually triggered February 6, 2025 08:45
Status Failure
Total duration 1h 36m 40s
Artifacts 3

integration-test-runner-JDK11.yml

on: workflow_dispatch
Fit to window
Zoom out
Zoom in

Annotations

2 errors and 2 warnings
build
PR BUILD not successfull. Check artifacts for logs.
build
Process completed with exit code 1.
build
build
=========================================================== product-is BUILD FAILURE ========================================================== [INFO] Results: [INFO] [ERROR] Failures: [ERROR] org.wso2.identity.integration.test.rest.api.server.organization.management.v1.OrganizationManagementSuccessTest.testOnboardChildOrganization(org.wso2.identity.integration.test.rest.api.server.organization.management.v1.OrganizationManagementSuccessTest) [ERROR] Run 1: OrganizationManagementSuccessTest.testOnboardChildOrganization:436 expected:<201> but was:<401> [ERROR] Run 2: OrganizationManagementSuccessTest.testOnboardChildOrganization:436 expected:<201> but was:<401> [INFO] [ERROR] org.wso2.identity.integration.test.user.store.OrganizationSecondaryUserStoreTestCase.testGetAccessTokenSecondaryJDBCUserStore(org.wso2.identity.integration.test.user.store.OrganizationSecondaryUserStoreTestCase) [ERROR] Run 1: OrganizationSecondaryUserStoreTestCase.testGetAccessTokenSecondaryJDBCUserStore:290->getAuthorizationCode:392->getLocationHeader:462 Unexpected response status code. expected:<302> but was:<403> [ERROR] Run 2: OrganizationSecondaryUserStoreTestCase.testGetAccessTokenSecondaryJDBCUserStore:290->getAuthorizationCode:392->getLocationHeader:462 Unexpected response status code. expected:<302> but was:<403> [INFO] [INFO] [ERROR] Tests run: 3094, Failures: 2, Errors: 0, Skipped: 44 [INFO] [INFO] ------------------------------------------------------------------------ [INFO] Reactor Summary for WSO2 Identity Server 7.1.0-alpha2-SNAPSHOT: [INFO] [INFO] WSO2 Identity Server ............................... SUCCESS [ 0.440 s] [INFO] WSO2 Identity Server Styles Parent ................. SUCCESS [ 0.046 s] [INFO] Identity Server: UI styles ......................... SUCCESS [ 2.494 s] [INFO] WSO2 IS - Features Aggregator Module ............... SUCCESS [ 0.018 s] [INFO] WSO2 IS - Style Features ........................... SUCCESS [ 0.965 s] [INFO] WSO2 IS - Utils Features ........................... SUCCESS [ 0.159 s] [INFO] WSO2 Carbon - Identity UI Feature .................. SUCCESS [ 0.892 s] [INFO] WSO2 IS - IS Profile Generation .................... SUCCESS [ 33.297 s] [INFO] Identity Server : Connector ........................ SUCCESS [ 0.242 s] [INFO] WSO2 Identity Server - Rest API .................... SUCCESS [ 0.011 s] [INFO] WSO2 Identity Server - All Rest API ................ SUCCESS [ 13.582 s] [INFO] Identity Server : identity-authenticators .......... SUCCESS [ 0.017 s] [INFO] Identity Server : Social-authenticators ............ SUCCESS [ 0.027 s] [INFO] Identity Server : Provisioning Connectors .......... SUCCESS [ 0.022 s] [INFO] Identity Server : identity-local-authenticators .... SUCCESS [ 0.028 s] [INFO] Identity Server : oauth2-grant-types ............... SUCCESS [ 0.013 s] [INFO] Identity Server : identity-integration-ui-templates SUCCESS [ 0.126 s] [INFO] Identity Server .................................... SUCCESS [ 24.821 s] [INFO] WSO2 Identity Integration Test Utils ............... SUCCESS [ 0.011 s] [INFO] org.wso2.carbon.identity.test.integration.service .. SUCCESS [ 2.219 s] [INFO] org.wso2.carbon.identity.test.integration.service.stubs SUCCESS [ 5.476 s] [INFO] Identity Server Integration Tests .................. SUCCESS [ 2.395 s] [INFO] WSO2 IS - Integration Test Admin Clients Module .... SUCCESS [ 3.284 s] [INFO] WSO2 IS - Integration UI Pages Module .............. SUCCESS [ 1.687 s] [INFO] WSO2 IS - Integration Test Utils Module ............ SUCCESS [ 2.199 s] [INFO] jacoco-report-generator ............................ SUCCESS [ 1.735 s] [INFO] WSO2 Identity Integration Test Common .............. SUCCESS [ 1.055 s] [INFO] Identity Test Back-end Module ...................... FAILURE [ 01:32 h] [INFO] org.wso2.identity.integration.test ................. SKIPPED [INFO] ------------------------------------------------------------------------ [INFO] BUILD FAILURE [INFO] ------------------------------------------------------------------------ [INFO] Total

Artifacts

Produced during runtime
Name Size Digest
product-is-mvn-build-log
801 KB
sha256:cbd8f306d625458b3cc384a67c7e526f0587c75eb4494377e79bc5ed4dce5aab
product-is-surefire-report
915 KB
sha256:7cbcd6cac5af026e77f584092e989595b1b62251ed20f032c64522cefbc364e1
repo-pr-diff
8.2 KB
sha256:82c5665bde7dfaf4f99d36f3fe0c947be335d71832049c7c140e2bf7e1e3a9ee